Тесты не проходят 2
От: Ka3a4oK  
Дата: 02.11.11 05:00
Оценка:
Master не собирается.

test_error.log:

-------------------------
Test of d:/Nemerle/ncc/testsuite/positive/Issue-git-0150-lib.n
-------------------------
Unexpected Nemerle compiler's message :
d:/Nemerle/ncc/testsuite/positive/Issue-git-0150-lib.n:13:1:13:19: error: referenced namespace `System.Linq' does not exist
-------------------------
Nemerle compile test failed
-------------------------
-------------------------
Test of d:/Nemerle/ncc/testsuite/positive/Issue-git-0160.n
-------------------------
Unexpected Nemerle compiler's message :
d:/Nemerle/ncc/testsuite/positive/Issue-git-0160.n:4:1:4:19: error: referenced namespace `System.Linq' does not exist
-------------------------
Unexpected Nemerle compiler's message :
d:/Nemerle/ncc/testsuite/positive/Issue-git-0160.n:60:17:61:18: error: there is no member named `SelectMany' in array[System.Type] with type ?
-------------------------
Nemerle compile test failed
-------------------------

Re: Тесты не проходят 2
От: VladD2 Российская Империя www.nemerle.org
Дата: 02.11.11 14:48
Оценка:
Здравствуйте, Ka3a4oK, Вы писали:

KK>Test of d:/Nemerle/ncc/testsuite/positive/Issue-git-0160.n


Очередная проблема с SRE. В 4.0 эмит энумов как значений атрибутов работает, а в 3.5 — нет.

Сейчас разбираюсь в проблеме.
http://nemerle.org/Banners/?g=dark
Есть логика намерений и логика обстоятельств, последняя всегда сильнее.
 
Подождите ...
Wait...
Пока на собственное сообщение не было ответов, его можно удалить.